exp build:android fails with 503 server error

#1

Worked fine this morning, but when I tried to build again tonight, it keeps failing.

The error I’m getting in the logs is:

`[stderr] Note: /app/workingdir/modules/expo-gl/android/src/main/java/expo/modules/gl/GLContext.java uses unchecked or unsafe operations.

[stderr] Note: Recompile with -Xlint:unchecked for details.

:expo-core:transformNativeLibsWithIntermediateJniLibsForRelease

[stderr] Note: /app/workingdir/modules/expo-file-system/android/src/main/java/expo/modules/filesystem/FileSystemModule.java uses unchecked or unsafe operations.

[stderr] Note: Recompile with -Xlint:unchecked for details.

:expo-sms:transformClassesAndResourcesWithPrepareIntermediateJarsForRelease

:expo-file-system:transformClassesAndResourcesWithPrepareIntermediateJarsForRelease

:expo-permissions:transformClassesAndResourcesWithPrepareIntermediateJarsForRelease

:expo-face-detector:transformClassesAndResourcesWithPrepareIntermediateJarsForRelease

:expo-camera:transformClassesAndResourcesWithPrepareIntermediateJarsForRelease

:expo-react-native-adapter:transformClassesAndResourcesWithPrepareIntermediateJarsForRelease

:ReactAndroid:downloadDoubleConversion

[stderr] Unable to get progress logger. Download progress will not be displayed.

:ReactAndroid:prepareDoubleConversion

:ReactAndroid:downloadFolly

[stderr] Unable to get progress logger. Download progress will not be displayed.

:ReactAndroid:prepareFolly

:ReactAndroid:downloadGlog

[stderr] Unable to get progress logger. Download progress will not be displayed.

:ReactAndroid:prepareGlog

:ReactAndroid:downloadJSCHeaders

[stderr] Unable to get progress logger. Download progress will not be displayed.

[stderr] Unable to get progress logger. Download progress will not be displayed.

[stderr] Unable to get progress logger. Download progress will not be displayed.

FAILED

[stderr] FAILURE: Build failed with an exception.

[stderr] * What went wrong:

[stderr] Execution failed for task ‘:ReactAndroid:downloadJSCHeaders’.

[stderr] > java.io.IOException: Server returned HTTP response code: 503 for URL: https://raw.githubusercontent.com/WebKit/webkit/38b15a3ba3c1b0798f2036f7cea36ffdc096202e/Source/JavaScriptCore/API/JSContextRef.h

[stderr] * Try:

[stderr] Run with --stacktrace option to get the stack trace. Run with --info or --debug option to get more log output. Run with --scan to get full insights.

[stderr] * Get more help at https://help.gradle.org

[stderr] BUILD FAILED in 1m 24s

370 actionable tasks: 370 executed

Error: Process exited with non-zero code: 1 at ChildProcess.child.on (/app/node_modules/@expo/spawn-async/build/spawnAsync.js:39:21) at emitTwo (events.js:126:13) at ChildProcess.emit (events.js:214:7) at maybeClose (internal/child_process.js:925:16) at Process.ChildProcess._handle.onexit (internal/child_process.js:209:5)`

closed #2

This topic was automatically closed 15 days after the last reply. New replies are no longer allowed.