Help: Standalone Build Failed (Android)

I have an error when I tried to build my andriod app, IOS app is build successfully.

this is the error that I have, can someone help me?

[stderr] FAILURE: Build failed with an exception.
[stderr] * What went wrong:
[stderr] Execution failed for task ':app:mergeReleaseResources'.
[stderr] > java.util.concurrent.ExecutionException: com.android.builder.internal.aapt.v2.Aapt2Exception: Android resource compilation failed
[stderr]   /app/turtle/workingdir/android/sdk34/android-shell-app/app/src/main/res/drawable-xxxhdpi/shell_launch_background_image.png: error: failed to read PNG signature: file does not start with PNG signature.
[stderr] * Try:
[stderr] Run with --stacktrace option to get the stack trace. Run with --info or --debug option to get more log output. Run with --scan to get full insights.
[stderr] * Get more help at https://help.gradle.org
[stderr] BUILD FAILED in 1m 29s
Error: ./gradlew exited with non-zero code: 1
    at ChildProcess.completionListener (/app/turtle/node_modules/@expo/xdl/node_modules/@expo/spawn-async/build/spawnAsync.js:52:23)
    at Object.onceWrapper (events.js:317:30)
    at emitTwo (events.js:126:13)
    at ChildProcess.emit (events.js:214:7)
    at maybeClose (internal/child_process.js:915:16)
    at Process.ChildProcess._handle.onexit (internal/child_process.js:209:5)
    ...
    at spawnAsync (/app/turtle/node_modules/@expo/xdl/node_modules/@expo/spawn-async/build/spawnAsync.js:17:21)
    at spawnAsyncThrowError (/app/turtle/node_modules/@expo/xdl/build/detach/ExponentTools.js:169:43)
    at buildShellAppAsync (/app/turtle/node_modules/@expo/xdl/build/detach/AndroidShellApp.js:697:11)
    at <anonymous>

It looks like shell_launch_background_image.png is not actually a PNG.